installArchives() failed:
Extracting templates from packages: 83%%
Extracting templates from packages: 100%%
Extracting templates from packages: 83%%
Extracting template… (читать ещё)
installArchives() failed:
Extracting templates from packages: 83%%
Extracting templates from packages: 100%%
Extracting templates from packages: 83%%
Extracting templates from packages: 100%%
Selecting previously unselected package linux-main-modules-zfs-7.0.0-38-generic.
(Reading database
(Reading database 5%%
(Reading database 10%%
(Reading database 15%%
(Reading database 20%%
(Reading database 25%%
(Reading database 30%%
(Reading database 35%%
(Reading database 40%%
(Reading database 45%%
(Reading database 50%%
(Reading database 55%%
(Reading database 60%%
(Reading database 65%%
(Reading database 70%%
(Reading database 75%%
(Reading database 80%%
(Reading database 85%%
(Reading database 90%%
(Reading database 95%%
(Reading database 100%%
(Reading database 573542 files and directories currently installed.)
Preparing to unpack /00-linux-main-modules-zfs-7.0.0-38-generic_7.0.0-38.38~24.04.4_amd64.deb
Unpacking linux-main-modules-zfs-7.0.0-38-generic (7.0.0-38.38~24.04.4)
Selecting previously unselected package linux-main-modules-v4l2loopback-7.0.0-38-generic.
Preparing to unpack /01-linux-main-modules-v4l2loopback-7.0.0-38-generic_7.0.0-38.38~24.04.4_amd64.deb
Unpacking linux-main-modules-v4l2loopback-7.0.0-38-generic (7.0.0-38.38~24.04.4)
Selecting previously unselected package linux-modules-7.0.0-38-generic.
Preparing to unpack /02-linux-modules-7.0.0-38-generic_7.0.0-38.38~24.04.4_amd64.deb
Unpacking linux-modules-7.0.0-38-generic (7.0.0-38.38~24.04.4)
Selecting previously unselected package linux-image-7.0.0-38-generic.
Preparing to unpack /03-linux-image-7.0.0-38-generic_7.0.0-38.38~24.04.4_amd64.deb
Unpacking linux-image-7.0.0-38-generic (7.0.0-38.38~24.04.4)
Preparing to unpack /04-linux-generic-hwe-24.04_7.0.0-38.38~24.04.4_amd64.deb
Unpacking linux-generic-hwe-24.04 (7.0.0-38.38~24.04.4) over (7.0.0-34.34~24.04.1)
Preparing to unpack /05-linux-image-generic-hwe-24.04_7.0.0-38.38~24.04.4_amd64.deb
Unpacking linux-image-generic-hwe-24.04 (7.0.0-38.38~24.04.4) over (7.0.0-34.34~24.04.1)
Selecting previously unselected package linux-hwe-7.0-headers-7.0.0-38.
Preparing to unpack /06-linux-hwe-7.0-headers-7.0.0-38_7.0.0-38.38~24.04.4_all.deb
Unpacking linux-hwe-7.0-headers-7.0.0-38 (7.0.0-38.38~24.04.4)
Selecting previously unselected package linux-headers-7.0.0-38-generic.
Preparing to unpack /07-linux-headers-7.0.0-38-generic_7.0.0-38.38~24.04.4_amd64.deb
Unpacking linux-headers-7.0.0-38-generic (7.0.0-38.38~24.04.4)
Preparing to unpack /08-linux-headers-generic-hwe-24.04_7.0.0-38.38~24.04.4_amd64.deb
Unpacking linux-headers-generic-hwe-24.04 (7.0.0-38.38~24.04.4) over (7.0.0-34.34~24.04.1)
Preparing to unpack /09-libgl1-mesa-dri_25.2.8-0ubuntu0.24.04.4_i386.deb
De-configuring libgl1-mesa-dri:amd64 (25.2.8-0ubuntu0.24.04.2), to allow configuration of libgl1-mesa-dri:i386 (25.2.8-0ubuntu0.24.04.4)
Unpacking libgl1-mesa-dri:i386 (25.2.8-0ubuntu0.24.04.4) over (25.2.8-0ubuntu0.24.04.2)
Preparing to unpack /10-libgl1-mesa-dri_25.2.8-0ubuntu0.24.04.4_amd64.deb
Unpacking libgl1-mesa-dri:amd64 (25.2.8-0ubuntu0.24.04.4) over (25.2.8-0ubuntu0.24.04.2)
Preparing to unpack /11-mesa-va-drivers_25.2.8-0ubuntu0.24.04.4_i386.deb
De-configuring mesa-va-drivers:amd64 (25.2.8-0ubuntu0.24.04.2), to allow configuration of mesa-va-drivers:i386 (25.2.8-0ubuntu0.24.04.4)
Unpacking mesa-va-drivers:i386 (25.2.8-0ubuntu0.24.04.4) over (25.2.8-0ubuntu0.24.04.2)
Preparing to unpack /12-mesa-va-drivers_25.2.8-0ubuntu0.24.04.4_amd64.deb
Unpacking mesa-va-drivers:amd64 (25.2.8-0ubuntu0.24.04.4) over (25.2.8-0ubuntu0.24.04.2)
Preparing to unpack /13-libglx-mesa0_25.2.8-0ubuntu0.24.04.4_i386.deb
De-configuring libglx-mesa0:amd64 (25.2.8-0ubuntu0.24.04.2), to allow configuration of libglx-mesa0:i386 (25.2.8-0ubuntu0.24.04.4)
Unpacking libglx-mesa0:i386 (25.2.8-0ubuntu0.24.04.4) over (25.2.8-0ubuntu0.24.04.2)
Preparing to unpack /14-libglx-mesa0_25.2.8-0ubuntu0.24.04.4_amd64.deb
Unpacking libglx-mesa0:amd64 (25.2.8-0ubuntu0.24.04.4) over (25.2.8-0ubuntu0.24.04.2)
Preparing to unpack /15-libegl-mesa0_25.2.8-0ubuntu0.24.04.4_i386.deb
De-configuring libegl-mesa0:amd64 (25.2.8-0ubuntu0.24.04.2), to allow configuration of libegl-mesa0:i386 (25.2.8-0ubuntu0.24.04.4)
Unpacking libegl-mesa0:i386 (25.2.8-0ubuntu0.24.04.4) over (25.2.8-0ubuntu0.24.04.2)
Preparing to unpack /16-libegl-mesa0_25.2.8-0ubuntu0.24.04.4_amd64.deb
Unpacking libegl-mesa0:amd64 (25.2.8-0ubuntu0.24.04.4) over (25.2.8-0ubuntu0.24.04.2)
Preparing to unpack /17-libgbm1_25.2.8-0ubuntu0.24.04.4_i386.deb
De-configuring libgbm1:amd64 (25.2.8-0ubuntu0.24.04.2), to allow configuration of libgbm1:i386 (25.2.8-0ubuntu0.24.04.4)
Unpacking libgbm1:i386 (25.2.8-0ubuntu0.24.04.4) over (25.2.8-0ubuntu0.24.04.2)
Preparing to unpack /18-libgbm1_25.2.8-0ubuntu0.24.04.4_amd64.deb
Unpacking libgbm1:amd64 (25.2.8-0ubuntu0.24.04.4) over (25.2.8-0ubuntu0.24.04.2)
Preparing to unpack /19-mesa-libgallium_25.2.8-0ubuntu0.24.04.4_amd64.deb
De-configuring mesa-libgallium:i386 (25.2.8-0ubuntu0.24.04.2), to allow configuration of mesa-libgallium:amd64 (25.2.8-0ubuntu0.24.04.4)
Unpacking mesa-libgallium:amd64 (25.2.8-0ubuntu0.24.04.4) over (25.2.8-0ubuntu0.24.04.2)
Preparing to unpack /20-mesa-libgallium_25.2.8-0ubuntu0.24.04.4_i386.deb
Unpacking mesa-libgallium:i386 (25.2.8-0ubuntu0.24.04.4) over (25.2.8-0ubuntu0.24.04.2)
Preparing to unpack /21-brave-browser_1.96.61_amd64.deb
Unpacking brave-browser (1.96.61) over (1.96.60)
Preparing to unpack /22-alsa-ucm-conf_1.2.10-1ubuntu5.15_all.deb
Unpacking alsa-ucm-conf (1.2.10-1ubuntu5.15) over (1.2.10-1ubuntu5.14)
Preparing to unpack /23-gstreamer1.0-gtk3_1.24.2-1ubuntu1.8_amd64.deb
Unpacking gstreamer1.0-gtk3:amd64 (1.24.2-1ubuntu1.8) over (1.24.2-1ubuntu1.7)
Preparing to unpack /24-gstreamer1.0-plugins-good_1.24.2-1ubuntu1.8_i386.deb
De-configuring gstreamer1.0-plugins-good:amd64 (1.24.2-1ubuntu1.7), to allow configuration of gstreamer1.0-plugins-good:i386 (1.24.2-1ubuntu1.8)
Unpacking gstreamer1.0-plugins-good:i386 (1.24.2-1ubuntu1.8) over (1.24.2-1ubuntu1.7)
Preparing to unpack /25-gstreamer1.0-plugins-good_1.24.2-1ubuntu1.8_amd64.deb
Unpacking gstreamer1.0-plugins-good:amd64 (1.24.2-1ubuntu1.8) over (1.24.2-1ubuntu1.7)
Preparing to unpack /26-libgstreamer-plugins-good1.0-0_1.24.2-1ubuntu1.8_amd64.deb
De-configuring libgstreamer-plugins-good1.0-0:i386 (1.24.2-1ubuntu1.7), to allow configuration of libgstreamer-plugins-good1.0-0:amd64 (1.24.2-1ubuntu1.8)
Unpacking libgstreamer-plugins-good1.0-0:amd64 (1.24.2-1ubuntu1.8) over (1.24.2-1ubuntu1.7)
Preparing to unpack /27-libgstreamer-plugins-good1.0-0_1.24.2-1ubuntu1.8_i386.deb
Unpacking libgstreamer-plugins-good1.0-0:i386 (1.24.2-1ubuntu1.8) over (1.24.2-1ubuntu1.7)
Preparing to unpack /28-libxpm4_1%%3a3.5.17-1ubuntu0.24.04.2_i386.deb
De-configuring libxpm4:amd64 (1:3.5.17-1ubuntu0.24.04.1), to allow configuration of libxpm4:i386 (1:3.5.17-1ubuntu0.24.04.2)
Unpacking libxpm4:i386 (1:3.5.17-1ubuntu0.24.04.2) over (1:3.5.17-1ubuntu0.24.04.1)
Preparing to unpack /29-libxpm4_1%%3a3.5.17-1ubuntu0.24.04.2_amd64.deb
Unpacking libxpm4:amd64 (1:3.5.17-1ubuntu0.24.04.2) over (1:3.5.17-1ubuntu0.24.04.1)
Selecting previously unselected package linux-hwe-7.0-tools-7.0.0-38.
Preparing to unpack /30-linux-hwe-7.0-tools-7.0.0-38_7.0.0-38.38~24.04.4_amd64.deb
Unpacking linux-hwe-7.0-tools-7.0.0-38 (7.0.0-38.38~24.04.4)
Selecting previously unselected package linux-tools-7.0.0-38-generic.
Preparing to unpack /31-linux-tools-7.0.0-38-generic_7.0.0-38.38~24.04.4_amd64.deb
Unpacking linux-tools-7.0.0-38-generic (7.0.0-38.38~24.04.4)
Preparing to unpack /32-mesa-vdpau-drivers_25.2.8-0ubuntu0.24.04.4_i386.deb
De-configuring mesa-vdpau-drivers:amd64 (25.2.8-0ubuntu0.24.04.2), to allow configuration of mesa-vdpau-drivers:i386 (25.2.8-0ubuntu0.24.04.4)
Unpacking mesa-vdpau-drivers:i386 (25.2.8-0ubuntu0.24.04.4) over (25.2.8-0ubuntu0.24.04.2)
Preparing to unpack /33-mesa-vdpau-drivers_25.2.8-0ubuntu0.24.04.4_amd64.deb
Unpacking mesa-vdpau-drivers:amd64 (25.2.8-0ubuntu0.24.04.4) over (25.2.8-0ubuntu0.24.04.2)
Preparing to unpack /34-mesa-vulkan-drivers_25.2.8-0ubuntu0.24.04.4_i386.deb
De-configuring mesa-vulkan-drivers:amd64 (25.2.8-0ubuntu0.24.04.2), to allow configuration of mesa-vulkan-drivers:i386 (25.2.8-0ubuntu0.24.04.4)
Unpacking mesa-vulkan-drivers:i386 (25.2.8-0ubuntu0.24.04.4) over (25.2.8-0ubuntu0.24.04.2)
Preparing to unpack /35-mesa-vulkan-drivers_25.2.8-0ubuntu0.24.04.4_amd64.deb
Unpacking mesa-vulkan-drivers:amd64 (25.2.8-0ubuntu0.24.04.4) over (25.2.8-0ubuntu0.24.04.2)
Setting up mesa-vulkan-drivers:amd64 (25.2.8-0ubuntu0.24.04.4)
Setting up mesa-vulkan-drivers:i386 (25.2.8-0ubuntu0.24.04.4)
Setting up mesa-vdpau-drivers:amd64 (25.2.8-0ubuntu0.24.04.4)
Setting up mesa-vdpau-drivers:i386 (25.2.8-0ubuntu0.24.04.4)
Setting up mesa-libgallium:amd64 (25.2.8-0ubuntu0.24.04.4)
Setting up mesa-libgallium:i386 (25.2.8-0ubuntu0.24.04.4)
Setting up linux-hwe-7.0-tools-7.0.0-38 (7.0.0-38.38~24.04.4)
Setting up libxpm4:amd64 (1:3.5.17-1ubuntu0.24.04.2)
Setting up libxpm4:i386 (1:3.5.17-1ubuntu0.24.04.2)
Setting up libgbm1:amd64 (25.2.8-0ubuntu0.24.04.4)
Setting up libgbm1:i386 (25.2.8-0ubuntu0.24.04.4)
Setting up alsa-ucm-conf (1.2.10-1ubuntu5.15)
Setting up libgl1-mesa-dri:amd64 (25.2.8-0ubuntu0.24.04.4)
Setting up libgl1-mesa-dri:i386 (25.2.8-0ubuntu0.24.04.4)
Setting up gstreamer1.0-gtk3:amd64 (1.24.2-1ubuntu1.8)
Setting up linux-tools-7.0.0-38-generic (7.0.0-38.38~24.04.4)
Setting up libgstreamer-plugins-good1.0-0:amd64 (1.24.2-1ubuntu1.8)
Setting up libgstreamer-plugins-good1.0-0:i386 (1.24.2-1ubuntu1.8)
Setting up libegl-mesa0:amd64 (25.2.8-0ubuntu0.24.04.4)
Setting up libegl-mesa0:i386 (25.2.8-0ubuntu0.24.04.4)
Setting up linux-image-7.0.0-34-generic (7.0.0-34.34~24.04.1)
Setting up linux-hwe-7.0-headers-7.0.0-38 (7.0.0-38.38~24.04.4)
Setting up brave-browser (1.96.61)
Setting up mesa-va-drivers:amd64 (25.2.8-0ubuntu0.24.04.4)
Setting up mesa-va-drivers:i386 (25.2.8-0ubuntu0.24.04.4)
Setting up linux-headers-7.0.0-34-generic (7.0.0-34.34~24.04.1)
/etc/kernel/header_postinst.d/dkms:
* dkms: running auto installation service for kernel 7.0.0-34-generic
Sign command: /usr/bin/kmodsign
Signing key: /var/lib/shim-signed/mok/MOK.priv
Public certificate (MOK): /var/lib/shim-signed/mok/MOK.der
Building module:
Cleaning build area...
make -j4 KERNELRELEASE=7.0.0-34-generic -C /lib/modules/7.0.0-34-generic/build M=/var/lib/dkms/virtualbox/7.0.16/build.......(bad exit status: 2)
Error! Bad return status for module build on kernel: 7.0.0-34-generic (x86_64)
Consult /var/lib/dkms/virtualbox/7.0.16/build/make.log for more information.
dkms autoinstall on 7.0.0-34-generic/x86_64 failed for virtualbox(10)
Error! One or more modules failed to install during autoinstall.
Refer to previous errors for more information.
* dkms: autoinstall for kernel 7.0.0-34-generic
...fail!
run-parts: /etc/kernel/header_postinst.d/dkms exited with return code 11
dpkg: error processing package linux-headers-7.0.0-34-generic (--configure):
installed linux-headers-7.0.0-34-generic package post-installation script subprocess returned error exit status 11
Setting up virtualbox-dkms (7.0.16-dfsg-2ubuntu1.3)
Removing old virtualbox-7.0.16 DKMS files...
Deleting module virtualbox-7.0.16 completely from the DKMS tree.
Loading new virtualbox-7.0.16 DKMS files...
Building for 7.0.0-31-generic 7.0.0-38-generic
Building initial module for 7.0.0-31-generic
Error! Bad return status for module build on kernel: 7.0.0-31-generic (x86_64)
Consult /var/lib/dkms/virtualbox/7.0.16/build/make.log for more information.
dpkg: error processing package virtualbox-dkms (--configure):
installed virtualbox-dkms package post-installation script subprocess returned error exit status 10
Setting up libglx-mesa0:amd64 (25.2.8-0ubuntu0.24.04.4)
Setting up libglx-mesa0:i386 (25.2.8-0ubuntu0.24.04.4)
Setting up gstreamer1.0-plugins-good:amd64 (1.24.2-1ubuntu1.8)
Setting up gstreamer1.0-plugins-good:i386 (1.24.2-1ubuntu1.8)
Setting up linux-headers-7.0.0-38-generic (7.0.0-38.38~24.04.4)
/etc/kernel/header_postinst.d/dkms:
* dkms: running auto installation service for kernel 7.0.0-38-generic
Sign command: /usr/bin/kmodsign
Signing key: /var/lib/shim-signed/mok/MOK.priv
Public certificate (MOK): /var/lib/shim-signed/mok/MOK.der
Building module:
Cleaning build area...
make -j4 KERNELRELEASE=7.0.0-38-generic -C /lib/modules/7.0.0-38-generic/build M=/var/lib/dkms/virtualbox/7.0.16/build.........(bad exit status: 2)
Error! Bad return status for module build on kernel: 7.0.0-38-generic (x86_64)
Consult /var/lib/dkms/virtualbox/7.0.16/build/make.log for more information.
dkms autoinstall on 7.0.0-38-generic/x86_64 failed for virtualbox(10)
Error! One or more modules failed to install during autoinstall.
Refer to previous errors for more information.
* dkms: autoinstall for kernel 7.0.0-38-generic
...fail!
run-parts: /etc/kernel/header_postinst.d/dkms exited with return code 11
dpkg: error processing package linux-headers-7.0.0-38-generic (--configure):
installed linux-headers-7.0.0-38-generic package post-installation script subprocess returned error exit status 11
dpkg: dependency problems prevent configuration of linux-headers-generic-hwe-24.04:
linux-headers-generic-hwe-24.04 depends on linux-headers-7.0.0-38-generic; however:
Package linux-headers-7.0.0-38-generic is not configured yet.
dpkg: error processing package linux-headers-generic-hwe-24.04 (--configure):
dependency problems - leaving unconfigured
dpkg: dependency problems prevent configuration of virtualbox:
virtualbox depends on virtualbox-dkms (>= 7.0.16-dfsg-2ubuntu1.3) | virtualbox-source (>= 7.0.16-dfsg-2ubuntu1.3) | virtualbox-modules; however:
Package virtualbox-dkms is not configured yet.
Package virtualbox-source is not installed.
Package virtualbox-modules is not installed.
Package virtualbox-dkms which provides virtualbox-modules is not configured yet.
dpkg: error processing package virtualbox (--configure):
dependency problems - leaving unconfigured
dpkg: dependency problems prevent configuration of linux-generic-hwe-24.04:
linux-generic-hwe-24.04 depends on linux-headers-generic-hwe-24.04 (= 7.0.0-38.38~24.04.4); however:
Package linux-headers-generic-hwe-24.04 is not configured yet.
dpkg: error processing package linux-generic-hwe-24.04 (--configure):
dependency problems - leaving unconfigured
dpkg: dependency problems prevent configuration of virtualbox-qt:
virtualbox-qt depends on virtualbox (= 7.0.16-dfsg-2ubuntu1.3); however:
Package virtualbox is not configured yet.
dpkg: error processing package virtualbox-qt (--configure):
dependency problems - leaving unconfigured
Setting up linux-image-7.0.0-38-generic (7.0.0-38.38~24.04.4)
I: /boot/vmlinuz.old is now a symlink to vmlinuz-7.0.0-34-generic
I: /boot/vmlinuz is now a symlink to vmlinuz-7.0.0-38-generic
I: /boot/initrd.img is now a symlink to initrd.img-7.0.0-38-generic
Setting up linux-main-modules-v4l2loopback-7.0.0-38-generic (7.0.0-38.38~24.04.4)
Setting up linux-main-modules-zfs-7.0.0-38-generic (7.0.0-38.38~24.04.4)
Setting up linux-modules-7.0.0-38-generic (7.0.0-38.38~24.04.4)
Setting up linux-image-generic-hwe-24.04 (7.0.0-38.38~24.04.4)
Processing triggers for libc-bin (2.39-0ubuntu8.9)
Processing triggers for man-db (2.12.0-4build2)
Processing triggers for mailcap (3.70+nmu1ubuntu1.24.04.1)
Processing triggers for desktop-file-utils (0.27-2build1)
Processing triggers for gnome-menus (3.36.0-1.1ubuntu3)
Processing triggers for linux-image-7.0.0-34-generic (7.0.0-34.34~24.04.1)
/etc/kernel/postinst.d/dkms:
* dkms: running auto installation service for kernel 7.0.0-34-generic
Sign command: /usr/bin/kmodsign
Signing key: /var/lib/shim-signed/mok/MOK.priv
Public certificate (MOK): /var/lib/shim-signed/mok/MOK.der
Building module:
Cleaning build area...
make -j4 KERNELRELEASE=7.0.0-34-generic -C /lib/modules/7.0.0-34-generic/build M=/var/lib/dkms/virtualbox/7.0.16/build........(bad exit status: 2)
Error! Bad return status for module build on kernel: 7.0.0-34-generic (x86_64)
Consult /var/lib/dkms/virtualbox/7.0.16/build/make.log for more information.
dkms autoinstall on 7.0.0-34-generic/x86_64 failed for virtualbox(10)
Error! One or more modules failed to install during autoinstall.
Refer to previous errors for more information.
* dkms: autoinstall for kernel 7.0.0-34-generic
...fail!
run-parts: /etc/kernel/postinst.d/dkms exited with return code 11
dpkg: error processing package linux-image-7.0.0-34-generic (--configure):
installed linux-image-7.0.0-34-generic package post-installation script subprocess returned error exit status 11
Processing triggers for linux-image-7.0.0-38-generic (7.0.0-38.38~24.04.4)
/etc/kernel/postinst.d/dkms:
* dkms: running auto installation service for kernel 7.0.0-38-generic
Sign command: /usr/bin/kmodsign
Signing key: /var/lib/shim-signed/mok/MOK.priv
Public certificate (MOK): /var/lib/shim-signed/mok/MOK.der
Building module:
Cleaning build area...
make -j4 KERNELRELEASE=7.0.0-38-generic -C /lib/modules/7.0.0-38-generic/build M=/var/lib/dkms/virtualbox/7.0.16/build.......(bad exit status: 2)
Error! Bad return status for module build on kernel: 7.0.0-38-generic (x86_64)
Consult /var/lib/dkms/virtualbox/7.0.16/build/make.log for more information.
dkms autoinstall on 7.0.0-38-generic/x86_64 failed for virtualbox(10)
Error! One or more modules failed to install during autoinstall.
Refer to previous errors for more information.
* dkms: autoinstall for kernel 7.0.0-38-generic
...fail!
run-parts: /etc/kernel/postinst.d/dkms exited with return code 11
dpkg: error processing package linux-image-7.0.0-38-generic (--configure):
installed linux-image-7.0.0-38-generic package post-installation script subprocess returned error exit status 11
Errors were encountered while processing:
linux-headers-7.0.0-34-generic
virtualbox-dkms
linux-headers-7.0.0-38-generic
linux-headers-generic-hwe-24.04
virtualbox
linux-generic-hwe-24.04
virtualbox-qt
linux-image-7.0.0-34-generic
linux-image-7.0.0-38-generic
Setting up linux-image-7.0.0-38-generic (7.0.0-38.38~24.04.4)
Setting up linux-image-7.0.0-34-generic (7.0.0-34.34~24.04.1)
I: /boot/initrd.img.old is now a symlink to initrd.img-7.0.0-34-generic
Setting up linux-headers-7.0.0-38-generic (7.0.0-38.38~24.04.4)
/etc/kernel/header_postinst.d/dkms:
* dkms: running auto installation service for kernel 7.0.0-38-generic
Sign command: /usr/bin/kmodsign
Signing key: /var/lib/shim-signed/mok/MOK.priv
Public certificate (MOK): /var/lib/shim-signed/mok/MOK.der
Building module:
Cleaning build area...
make -j4 KERNELRELEASE=7.0.0-38-generic -C /lib/modules/7.0.0-38-generic/build M=/var/lib/dkms/virtualbox/7.0.16/build.......(bad exit status: 2)
Error! Bad return status for module build on kernel: 7.0.0-38-generic (x86_64)
Consult /var/lib/dkms/virtualbox/7.0.16/build/make.log for more information.
dkms autoinstall on 7.0.0-38-generic/x86_64 failed for virtualbox(10)
Error! One or more modules failed to install during autoinstall.
Refer to previous errors for more information.
* dkms: autoinstall for kernel 7.0.0-38-generic
...fail!
run-parts: /etc/kernel/header_postinst.d/dkms exited with return code 11
dpkg: error processing package linux-headers-7.0.0-38-generic (--configure):
installed linux-headers-7.0.0-38-generic package post-installation script subprocess returned error exit status 11
dpkg: dependency problems prevent configuration of linux-headers-generic-hwe-24.04:
linux-headers-generic-hwe-24.04 depends on linux-headers-7.0.0-38-generic; however:
Package linux-headers-7.0.0-38-generic is not configured yet.
dpkg: error processing package linux-headers-generic-hwe-24.04 (--configure):
dependency problems - leaving unconfigured
Setting up linux-headers-7.0.0-34-generic (7.0.0-34.34~24.04.1)
/etc/kernel/header_postinst.d/dkms:
* dkms: running auto installation service for kernel 7.0.0-34-generic
Sign command: /usr/bin/kmodsign
Signing key: /var/lib/shim-signed/mok/MOK.priv
Public certificate (MOK): /var/lib/shim-signed/mok/MOK.der
Building module:
Cleaning build area...
make -j4 KERNELRELEASE=7.0.0-34-generic -C /lib/modules/7.0.0-34-generic/build M=/var/lib/dkms/virtualbox/7.0.16/build.......(bad exit status: 2)
Error! Bad return status for module build on kernel: 7.0.0-34-generic (x86_64)
Consult /var/lib/dkms/virtualbox/7.0.16/build/make.log for more information.
dkms autoinstall on 7.0.0-34-generic/x86_64 failed for virtualbox(10)
Error! One or more modules failed to install during autoinstall.
Refer to previous errors for more information.
* dkms: autoinstall for kernel 7.0.0-34-generic
...fail!
run-parts: /etc/kernel/header_postinst.d/dkms exited with return code 11
dpkg: error processing package linux-headers-7.0.0-34-generic (--configure):
installed linux-headers-7.0.0-34-generic package post-installation script subprocess returned error exit status 11
Setting up virtualbox-dkms (7.0.16-dfsg-2ubuntu1.3)
Removing old virtualbox-7.0.16 DKMS files...
Deleting module virtualbox-7.0.16 completely from the DKMS tree.
Loading new virtualbox-7.0.16 DKMS files...
Building for 7.0.0-31-generic 7.0.0-38-generic
Building initial module for 7.0.0-31-generic
Error! Bad return status for module build on kernel: 7.0.0-31-generic (x86_64)
Consult /var/lib/dkms/virtualbox/7.0.16/build/make.log for more information.
dpkg: error processing package virtualbox-dkms (--configure):
installed virtualbox-dkms package post-installation script subprocess returned error exit status 10
dpkg: dependency problems prevent configuration of linux-generic-hwe-24.04:
linux-generic-hwe-24.04 depends on linux-headers-generic-hwe-24.04 (= 7.0.0-38.38~24.04.4); however:
Package linux-headers-generic-hwe-24.04 is not configured yet.
dpkg: error processing package linux-generic-hwe-24.04 (--configure):
dependency problems - leaving unconfigured
dpkg: dependency problems prevent configuration of virtualbox:
virtualbox depends on virtualbox-dkms (>= 7.0.16-dfsg-2ubuntu1.3) | virtualbox-source (>= 7.0.16-dfsg-2ubuntu1.3) | virtualbox-modules; however:
Package virtualbox-dkms is not configured yet.
Package virtualbox-source is not installed.
Package virtualbox-modules is not installed.
Package virtualbox-dkms which provides virtualbox-modules is not configured yet.
dpkg: error processing package virtualbox (--configure):
dependency problems - leaving unconfigured
dpkg: dependency problems prevent configuration of virtualbox-qt:
virtualbox-qt depends on virtualbox (= 7.0.16-dfsg-2ubuntu1.3); however:
Package virtualbox is not configured yet.
dpkg: error processing package virtualbox-qt (--configure):
dependency problems - leaving unconfigured
Processing triggers for linux-image-7.0.0-38-generic (7.0.0-38.38~24.04.4)
/etc/kernel/postinst.d/dkms:
* dkms: running auto installation service for kernel 7.0.0-38-generic
Sign command: /usr/bin/kmodsign
Signing key: /var/lib/shim-signed/mok/MOK.priv
Public certificate (MOK): /var/lib/shim-signed/mok/MOK.der
Building module:
Cleaning build area...
make -j4 KERNELRELEASE=7.0.0-38-generic -C /lib/modules/7.0.0-38-generic/build M=/var/lib/dkms/virtualbox/7.0.16/build..........(bad exit status: 2)
Error! Bad return status for module build on kernel: 7.0.0-38-generic (x86_64)
Consult /var/lib/dkms/virtualbox/7.0.16/build/make.log for more information.
dkms autoinstall on 7.0.0-38-generic/x86_64 failed for virtualbox(10)
Error! One or more modules failed to install during autoinstall.
Refer to previous errors for more information.
* dkms: autoinstall for kernel 7.0.0-38-generic
...fail!
run-parts: /etc/kernel/postinst.d/dkms exited with return code 11
dpkg: error processing package linux-image-7.0.0-38-generic (--configure):
installed linux-image-7.0.0-38-generic package post-installation script subprocess returned error exit status 11
Processing triggers for linux-image-7.0.0-34-generic (7.0.0-34.34~24.04.1)
/etc/kernel/postinst.d/dkms:
* dkms: running auto installation service for kernel 7.0.0-34-generic
Sign command: /usr/bin/kmodsign
Signing key: /var/lib/shim-signed/mok/MOK.priv
Public certificate (MOK): /var/lib/shim-signed/mok/MOK.der
Building module:
Cleaning build area...
make -j4 KERNELRELEASE=7.0.0-34-generic -C /lib/modules/7.0.0-34-generic/build M=/var/lib/dkms/virtualbox/7.0.16/build.........(bad exit status: 2)
Error! Bad return status for module build on kernel: 7.0.0-34-generic (x86_64)
Consult /var/lib/dkms/virtualbox/7.0.16/build/make.log for more information.
dkms autoinstall on 7.0.0-34-generic/x86_64 failed for virtualbox(10)
Error! One or more modules failed to install during autoinstall.
Refer to previous errors for more information.
* dkms: autoinstall for kernel 7.0.0-34-generic
...fail!
run-parts: /etc/kernel/postinst.d/dkms exited with return code 11
dpkg: error processing package linux-image-7.0.0-34-generic (--configure):
installed linux-image-7.0.0-34-generic package post-installation script subprocess returned error exit status 11